Builds the 1.1.x branch using JDK8

Build: #61 failed Changes by Spring Buildmaster

Build result summary

Details

Completed
Duration
44 minutes
Labels
None
Revision
a62351f1ae0a358a7e3ed212f0875c04f359a072 a62351f1ae0a358a7e3ed212f0875c04f359a072
Total tests
721
Failing since
#56 (Changes by Ilayaperumal Gopinathan)

Tests

Responsible

Code commits

Author Commit Message Commit date
Spring Buildmaster Spring Buildmaster a62351f1ae0a358a7e3ed212f0875c04f359a072 a62351f1ae0a358a7e3ed212f0875c04f359a072 [artifactory-release] Next development version
Spring Buildmaster Spring Buildmaster b7696b8053a861840b96694120a919a20d518710 b7696b8053a861840b96694120a919a20d518710 [artifactory-release] Release version 1.1.3.RELEASE

Tests

New test failures 2
Status Test View job Duration
Collapse Failed KafkaSingleNodeStreamDeploymentIntegrationTests testBasicTap History
Default Job 7 secs
java.lang.AssertionError: java.lang.AssertionError: expected:<DRACARYS!> but was:<null>
java.lang.AssertionError: expected:<DRACARYS!> but was:<null>
	at org.junit.Assert.fail(Assert.java:88)
	at org.junit.Assert.failNotEquals(Assert.java:834)
	at org.junit.Assert.assertEquals(Assert.java:118)
	at org.junit.Assert.assertEquals(Assert.java:144)
	at org.springframework.xd.dirt.stream.AbstractSingleNodeStreamDeploymentIntegrationTests.tapTest(AbstractSingleNodeStreamDeploymentIntegrationTests.java:608)
	at org.springframework.xd.dirt.stream.AbstractSingleNodeStreamDeploymentIntegrationTests.testBasicTap(AbstractSingleNodeStreamDeploymentIntegrationTests.java:272)
(47 more lines...)
Collapse Failed RabbitSingleNodeStreamDeploymentIntegrationTests mqttSourceStreamReceivesMqttSinkStreamOutputBinary History
Default Job 8 secs
java.lang.AssertionError: java.lang.AssertionError: 
Expected: an instance of [B
     but: null
java.lang.AssertionError: 
Expected: an instance of [B
     but: null
	at org.springframework.test.util.MatcherAssertionErrors.assertThat(MatcherAssertionErrors.java:80)
	at org.springframework.test.util.MatcherAssertionErrors.assertThat(MatcherAssertionErrors.java:53)
(49 more lines...)