Builds the 1.1.x branch using JDK8

Build: #1 failed

Job: Default Job failed

Stages & jobs

  1. Default Stage

Job result summary

Completed
Duration
26 minutes
Revision
09e69f223e30538a0a9ca0dd344e95d88d142fdc 09e69f223e30538a0a9ca0dd344e95d88d142fdc
Total tests
705
Fixed in
#6 (Code changes detected)

Tests

  • 705 tests in total
  • 1 test failed
  • 1 failure is new
  • 1 test was quarantined / skipped
  • 12 minutes taken in total.
New test failures 1
Status Test Duration
Collapse Failed KafkaSingleNodeStreamDeploymentIntegrationTests verifyQueueChannelsRegisteredOnDemand History
6 secs
java.lang.IllegalArgumentException: java.lang.IllegalArgumentException:  No result received for Partition[topic='queue_3Ay', id=0]
java.lang.IllegalArgumentException:  No result received for Partition[topic='queue_3Ay', id=0]
	at org.springframework.integration.kafka.core.Result.getResult(Result.java:47)
	at org.springframework.xd.dirt.stream.KafkaSingleNodeStreamDeploymentIntegrationTests.receiveFromTopicForQueue(KafkaSingleNodeStreamDeploymentIntegrationTests.java:99)
	at org.springframework.xd.dirt.stream.KafkaSingleNodeStreamDeploymentIntegrationTests.verifyOnDemandQueues(KafkaSingleNodeStreamDeploymentIntegrationTests.java:89)
	at org.springframework.xd.dirt.stream.AbstractSingleNodeStreamDeploymentIntegrationTests.verifyQueueChannelsRegisteredOnDemand(AbstractSingleNodeStreamDeploymentIntegrationTests.java:434)
	at sun.reflect.NativeMethodAccessorImpl.invoke0(Native Method)
	at sun.reflect.NativeMethodAccessorImpl.invoke(NativeMethodAccessorImpl.java:62)
(45 more lines...)