Builds the 1.1.x branch using JDK8

Build: #48 failed

Job: Default Job failed

Stages & jobs

  1. Default Stage

Job result summary

Completed
Duration
27 minutes
Revision
cac7801f3cd83b7288e748676bb5f173996606ba cac7801f3cd83b7288e748676bb5f173996606ba
Total tests
721
Fixed in
#55 (Code changes detected)
Number of retries
1

Tests

  • 721 tests in total
  • 1 test failed
  • 1 failure is new
  • 1 test was quarantined / skipped
  • 12 minutes taken in total.
New test failures 1
Status Test Duration
Collapse Failed KafkaSingleNodeStreamDeploymentIntegrationTests testTappingWithRepeatedModulesDoesNotDuplicateMessages History
7 secs
java.lang.AssertionError: java.lang.AssertionError: expected:<DRACARYS!> but was:<null>
java.lang.AssertionError: expected:<DRACARYS!> but was:<null>
	at org.junit.Assert.fail(Assert.java:88)
	at org.junit.Assert.failNotEquals(Assert.java:834)
	at org.junit.Assert.assertEquals(Assert.java:118)
	at org.junit.Assert.assertEquals(Assert.java:144)
	at org.springframework.xd.dirt.stream.AbstractSingleNodeStreamDeploymentIntegrationTests.tapTest(AbstractSingleNodeStreamDeploymentIntegrationTests.java:608)
	at org.springframework.xd.dirt.stream.AbstractSingleNodeStreamDeploymentIntegrationTests.testTappingWithRepeatedModulesDoesNotDuplicateMessages(AbstractSingleNodeStreamDeploymentIntegrationTests.java:299)
(47 more lines...)