Builds the 1.1.x branch using JDK8

Build: #50 failed

Job: Default Job failed

Stages & jobs

  1. Default Stage

Job result summary

Completed
Duration
27 minutes
Revision
1401b8bd28ac7fa297b3376a509e6a8dd88cb689 1401b8bd28ac7fa297b3376a509e6a8dd88cb689
Total tests
721
Failing since
#48 (Rebuilt by Glenn Renfro)
Fixed in
#55 (Code changes detected)

Tests

  • 721 tests in total
  • 1 test failed
  • 1 failure is new
  • 1 test was fixed
  • 1 test was quarantined / skipped
  • 12 minutes taken in total.
New test failures 1
Status Test Duration
Collapse Failed KafkaSingleNodeStreamDeploymentIntegrationTests testBasicTap History
4 secs
java.lang.AssertionError: java.lang.AssertionError: expected:<DRACARYS!> but was:<null>
java.lang.AssertionError: expected:<DRACARYS!> but was:<null>
	at org.junit.Assert.fail(Assert.java:88)
	at org.junit.Assert.failNotEquals(Assert.java:834)
	at org.junit.Assert.assertEquals(Assert.java:118)
	at org.junit.Assert.assertEquals(Assert.java:144)
	at org.springframework.xd.dirt.stream.AbstractSingleNodeStreamDeploymentIntegrationTests.tapTest(AbstractSingleNodeStreamDeploymentIntegrationTests.java:608)
	at org.springframework.xd.dirt.stream.AbstractSingleNodeStreamDeploymentIntegrationTests.testBasicTap(AbstractSingleNodeStreamDeploymentIntegrationTests.java:272)
(47 more lines...)
Fixed tests 1
Status Test Failing since Duration
Successful KafkaSingleNodeStreamDeploymentIntegrationTests testTappingWithRepeatedModulesDoesNotDuplicateMessages History
Failing since build #48 (Rebuilt by Glenn Renfro) 9 secs