Builds the 1.1.x branch using JDK8

Build: #51 failed

Job: Default Job failed

Stages & jobs

  1. Default Stage

Job result summary

Completed
Duration
26 minutes
Revision
6fd600bf678422a2d6bc984820e5319554ea2bb9 6fd600bf678422a2d6bc984820e5319554ea2bb9
Total tests
721
Failing since
#48 (Rebuilt by Glenn Renfro)
Fixed in
#55 (Code changes detected)

Tests

  • 721 tests in total
  • 1 test failed
  • 1 failure is new
  • 1 test was fixed
  • 1 test was quarantined / skipped
  • 12 minutes taken in total.
New test failures 1
Status Test Duration
Collapse Failed KafkaSingleNodeStreamDeploymentIntegrationTests verifyQueueChannelsRegisteredOnDemand History
9 secs
java.lang.IndexOutOfBoundsException: java.lang.IndexOutOfBoundsException: Index: 0 Size: 0
java.lang.IndexOutOfBoundsException: Index: 0 Size: 0
	at com.gs.collections.impl.list.mutable.FastList.newIndexOutOfBoundsException(FastList.java:1078)
	at com.gs.collections.impl.list.mutable.FastList.get(FastList.java:1073)
	at org.springframework.xd.dirt.stream.KafkaSingleNodeStreamDeploymentIntegrationTests.receiveFromTopicForQueue(KafkaSingleNodeStreamDeploymentIntegrationTests.java:136)
	at org.springframework.xd.dirt.stream.KafkaSingleNodeStreamDeploymentIntegrationTests.verifyOnDemandQueues(KafkaSingleNodeStreamDeploymentIntegrationTests.java:86)
	at org.springframework.xd.dirt.stream.AbstractSingleNodeStreamDeploymentIntegrationTests.verifyQueueChannelsRegisteredOnDemand(AbstractSingleNodeStreamDeploymentIntegrationTests.java:477)
	at sun.reflect.NativeMethodAccessorImpl.invoke0(Native Method)
(46 more lines...)
Fixed tests 1
Status Test Failing since Duration
Successful KafkaSingleNodeStreamDeploymentIntegrationTests testBasicTap History
Failing since build #50 (Code changes detected) 6 secs