Builds the 1.1.x branch using JDK8

Build: #56 failed

Job: Default Job failed

Stages & jobs

  1. Default Stage

Job result summary

Completed
Duration
41 minutes
Revision
1009a00764235d2a72682edc352d91f20d796ae8 1009a00764235d2a72682edc352d91f20d796ae8
Total tests
953

Tests

  • 953 tests in total
  • 1 test failed
  • 1 failure is new
  • 4 tests were quarantined / skipped
  • 18 minutes taken in total.
New test failures 1
Status Test Duration
Collapse Failed JobCommandTests testNestedJobLaunch History
< 1 sec
java.lang.AssertionError: java.lang.AssertionError: Failure.  CommandResult = CommandResult [success=false, result=null, exception=org.springframework.xd.rest.client.impl.SpringXDException: Line 7 in XML document from file [/data/bamboo-home/xml-data/build-dir/XD-XD1JL-JOB1/spring-xd-shell/build/resources/test/spring-xd/xd/modules/job/nestedJob/config/nestedJob.xml] is invalid; nested exception is org.xml.sax.SAXParseException; lineNumber: 7; columnNumber: 66; cvc-elt.1: Cannot find the declaration of element 'beans'.
]
java.lang.AssertionError: Failure.  CommandResult = CommandResult [success=false, result=null, exception=org.springframework.xd.rest.client.impl.SpringXDException: Line 7 in XML document from file [/data/bamboo-home/xml-data/build-dir/XD-XD1JL-JOB1/spring-xd-shell/build/resources/test/spring-xd/xd/modules/job/nestedJob/config/nestedJob.xml] is invalid; nested exception is org.xml.sax.SAXParseException; lineNumber: 7; columnNumber: 66; cvc-elt.1: Cannot find the declaration of element 'beans'.
]
	at org.junit.Assert.fail(Assert.java:88)
	at org.junit.Assert.assertTrue(Assert.java:41)
	at org.springframework.xd.shell.AbstractShellIntegrationTest.executeCommand(AbstractShellIntegrationTest.java:177)
	at org.springframework.xd.shell.command.AbstractJobIntegrationTest.executeJobCreate(AbstractJobIntegrationTest.java:147)
(64 more lines...)