Builds the 1.1.x branch using JDK8

Build: #57 failed

Job: Default Job failed

Stages & jobs

  1. Default Stage

Job result summary

Completed
Duration
65 minutes
Revision
d3b68edd22cc9d90b40e92fff331f471d238a96b d3b68edd22cc9d90b40e92fff331f471d238a96b
Total tests
1001
Failing since
#56 (Code changes detected – )

Tests

  • 1,001 tests in total
  • 3 tests failed
  • 3 failures are new
  • 1 test was fixed
  • 4 tests were quarantined / skipped
  • 41 minutes taken in total.
New test failures 3
Status Test Duration
Collapse Failed KafkaTransportSparkStreamingTests testSparkProcessorWithOutputType History
4 secs
java.lang.OutOfMemoryError: java.lang.OutOfMemoryError: GC overhead limit exceeded
java.lang.OutOfMemoryError: GC overhead limit exceeded
	at java.util.Arrays.copyOfRange(Arrays.java:3664)
	at java.lang.String.<init>(String.java:201)
	at java.util.Properties.loadConvert(Properties.java:590)
	at java.util.Properties.load0(Properties.java:391)
	at java.util.Properties.load(Properties.java:341)
	at org.springframework.core.io.support.PropertiesLoaderUtils.fillProperties(PropertiesLoaderUtils.java:139)
(26 more lines...)java.lang.NullPointerException: java.lang.NullPointerException
java.lang.NullPointerException
	at org.springframework.xd.spark.streaming.AbstractSparkStreamingTests.tearDown(AbstractSparkStreamingTests.java:92)
	at sun.reflect.NativeMethodAccessorImpl.invoke0(Native Method)
	at sun.reflect.NativeMethodAccessorImpl.invoke(NativeMethodAccessorImpl.java:62)
	at sun.reflect.DelegatingMethodAccessorImpl.invoke(DelegatingMethodAccessorImpl.java:43)
	at java.lang.reflect.Method.invoke(Method.java:483)
	at org.junit.runners.model.FrameworkMethod$1.runReflectiveCall(FrameworkMethod.java:50)
(43 more lines...)
Collapse Failed KafkaTransportSparkStreamingTests testSparkScalaFileLoggerWithInputType History
4 mins
java.lang.OutOfMemoryError: java.lang.OutOfMemoryError: GC overhead limit exceeded
java.lang.OutOfMemoryError: GC overhead limit exceeded
	at java.util.zip.ZipCoder.getBytes(ZipCoder.java:80)
	at java.util.zip.ZipFile.getEntry(ZipFile.java:311)
	at java.util.jar.JarFile.getEntry(JarFile.java:240)
	at java.util.jar.JarFile.getJarEntry(JarFile.java:223)
	at sun.misc.URLClassPath$JarLoader.getResource(URLClassPath.java:841)
	at sun.misc.URLClassPath$JarLoader.findResource(URLClassPath.java:819)
(26 more lines...)java.lang.NullPointerException: java.lang.NullPointerException
java.lang.NullPointerException
	at org.springframework.xd.spark.streaming.AbstractSparkStreamingTests.tearDown(AbstractSparkStreamingTests.java:92)
	at sun.reflect.NativeMethodAccessorImpl.invoke0(Native Method)
	at sun.reflect.NativeMethodAccessorImpl.invoke(NativeMethodAccessorImpl.java:62)
	at sun.reflect.DelegatingMethodAccessorImpl.invoke(DelegatingMethodAccessorImpl.java:43)
	at java.lang.reflect.Method.invoke(Method.java:483)
	at org.junit.runners.model.FrameworkMethod$1.runReflectiveCall(FrameworkMethod.java:50)
(43 more lines...)
Collapse Failed KafkaTransportSparkStreamingTests testSparkScalaProcessorWithInputType History
3 mins
java.lang.AssertionError: java.lang.AssertionError: 
Expected: "(foo,3)", trying at most 20 times
     but: failed after 20*100=2000ms:
failed with an IOException: Timeout after 1000ms waiting for file /tmp/FileSink6275304062986320269.txt, failed with an IOException: Timeout after 1000ms waiting for file /tmp/FileSink6275304062986320269.txt, failed with an IOException: Timeout after 1000ms waiting for file /tmp/FileSink6275304062986320269.txt, failed with an IOException: Timeout after 1000ms waiting for file /tmp/FileSink6275304062986320269.txt, failed with an IOException: Timeout after 1000ms waiting for file /tmp/FileSink6275304062986320269.txt, failed with an IOException: Timeout after 1000ms waiting for file /tmp/FileSink6275304062986320269.txt, failed with an IOException: Timeout after 1000ms waiting for file /tmp/FileSink6275304062986320269.txt, failed with an IOException: Timeout after 1000ms waiting for file /tmp/FileSink6275304062986320269.txt, failed with an IOException: Timeout after 1000ms waiting for file /tmp/FileSink6275304062986320269.txt, failed with an IOException: Timeout after 1000ms waiting for file /tmp/FileSink6275304062986320269.txt, failed with an IOException: Timeout after 1000ms waiting for file /tmp/FileSink6275304062986320269.txt, failed with an IOException: Timeout after 1000ms waiting for file /tmp/FileSink6275304062986320269.txt, failed with an IOException: Timeout after 1000ms waiting for file /tmp/FileSink6275304062986320269.txt, failed with an IOException: Timeout after 1000ms waiting for file /tmp/FileSink6275304062986320269.txt, failed with an IOException: Timeout after 1000ms waiting for file /tmp/FileSink6275304062986320269.txt, failed with an IOException: Timeout after 1000ms waiting for file /tmp/FileSink6275304062986320269.txt, failed with an IOException: Timeout after 1000ms waiting for file /tmp/FileSink6275304062986320269.txt, failed with an IOException: Timeout after 1000ms waiting for file /tmp/FileSink6275304062986320269.txt, failed with an IOException: Timeout after 1000ms waiting for file /tmp/FileSink6275304062986320269.txt, failed with an IOException: Timeout after 1000ms waiting for file /tmp/FileSink6275304062986320269.txt, 
java.lang.AssertionError: 
Expected: "(foo,3)", trying at most 20 times
     but: failed after 20*100=2000ms:
failed with an IOException: Timeout after 1000ms waiting for file /tmp/FileSink6275304062986320269.txt, failed with an IOException: Timeout after 1000ms waiting for file /tmp/FileSink6275304062986320269.txt, failed with an IOException: Timeout after 1000ms waiting for file /tmp/FileSink6275304062986320269.txt, failed with an IOException: Timeout after 1000ms waiting for file /tmp/FileSink6275304062986320269.txt, failed with an IOException: Timeout after 1000ms waiting for file /tmp/FileSink6275304062986320269.txt, failed with an IOException: Timeout after 1000ms waiting for file /tmp/FileSink6275304062986320269.txt, failed with an IOException: Timeout after 1000ms waiting for file /tmp/FileSink6275304062986320269.txt, failed with an IOException: Timeout after 1000ms waiting for file /tmp/FileSink6275304062986320269.txt, failed with an IOException: Timeout after 1000ms waiting for file /tmp/FileSink6275304062986320269.txt, failed with an IOException: Timeout after 1000ms waiting for file /tmp/FileSink6275304062986320269.txt, failed with an IOException: Timeout after 1000ms waiting for file /tmp/FileSink6275304062986320269.txt, failed with an IOException: Timeout after 1000ms waiting for file /tmp/FileSink6275304062986320269.txt, failed with an IOException: Timeout after 1000ms waiting for file /tmp/FileSink6275304062986320269.txt, failed with an IOException: Timeout after 1000ms waiting for file /tmp/FileSink6275304062986320269.txt, failed with an IOException: Timeout after 1000ms waiting for file /tmp/FileSink6275304062986320269.txt, failed with an IOException: Timeout after 1000ms waiting for file /tmp/FileSink6275304062986320269.txt, failed with an IOException: Timeout after 1000ms waiting for file /tmp/FileSink6275304062986320269.txt, failed with an IOException: Timeout after 1000ms waiting for file /tmp/FileSink6275304062986320269.txt, failed with an IOException: Timeout after 1000ms waiting for file /tmp/FileSink6275304062986320269.txt, failed with an IOException: Timeout after 1000ms waiting for file /tmp/FileSink6275304062986320269.txt, 
(54 more lines...)
Fixed tests 1
Status Test Failing since Duration
Successful JobCommandTests testNestedJobLaunch History
Failing since build #56 (Code changes detected) 15 secs