Builds the 1.1.x branch using JDK8

Build: #61 failed

Job: Default Job failed

Stages & jobs

  1. Default Stage

Job result summary

Completed
Duration
44 minutes
Revision
a62351f1ae0a358a7e3ed212f0875c04f359a072 a62351f1ae0a358a7e3ed212f0875c04f359a072
Total tests
721
Failing since
#56 (Code changes detected – )

Tests

  • 721 tests in total
  • 2 tests failed
  • 2 failures are new
  • 3 tests were quarantined / skipped
  • 15 minutes taken in total.
New test failures 2
Status Test Duration
Collapse Failed KafkaSingleNodeStreamDeploymentIntegrationTests testBasicTap History
7 secs
java.lang.AssertionError: java.lang.AssertionError: expected:<DRACARYS!> but was:<null>
java.lang.AssertionError: expected:<DRACARYS!> but was:<null>
	at org.junit.Assert.fail(Assert.java:88)
	at org.junit.Assert.failNotEquals(Assert.java:834)
	at org.junit.Assert.assertEquals(Assert.java:118)
	at org.junit.Assert.assertEquals(Assert.java:144)
	at org.springframework.xd.dirt.stream.AbstractSingleNodeStreamDeploymentIntegrationTests.tapTest(AbstractSingleNodeStreamDeploymentIntegrationTests.java:608)
	at org.springframework.xd.dirt.stream.AbstractSingleNodeStreamDeploymentIntegrationTests.testBasicTap(AbstractSingleNodeStreamDeploymentIntegrationTests.java:272)
(47 more lines...)
Collapse Failed RabbitSingleNodeStreamDeploymentIntegrationTests mqttSourceStreamReceivesMqttSinkStreamOutputBinary History
8 secs
java.lang.AssertionError: java.lang.AssertionError: 
Expected: an instance of [B
     but: null
java.lang.AssertionError: 
Expected: an instance of [B
     but: null
	at org.springframework.test.util.MatcherAssertionErrors.assertThat(MatcherAssertionErrors.java:80)
	at org.springframework.test.util.MatcherAssertionErrors.assertThat(MatcherAssertionErrors.java:53)
(49 more lines...)