Builds the 1.1.x branch using JDK8

Build: #62 failed

Job: Default Job failed

Stages & jobs

  1. Default Stage

Job result summary

Completed
Duration
39 minutes
Revision
a62351f1ae0a358a7e3ed212f0875c04f359a072 a62351f1ae0a358a7e3ed212f0875c04f359a072
Total tests
721
Failing since
#56 (Code changes detected – )

Tests

  • 721 tests in total
  • 2 tests failed
  • 1 failure is new
  • 1 test was fixed
  • 3 tests were quarantined / skipped
  • 17 minutes taken in total.
New test failures 1
Status Test Duration
Collapse Failed RabbitSingleNodeStreamDeploymentIntegrationTests mqttSourceStreamReceivesMqttSinkStreamOutput History
15 secs
java.lang.AssertionError: java.lang.AssertionError: expected:<hello> but was:<null>
java.lang.AssertionError: expected:<hello> but was:<null>
	at org.junit.Assert.fail(Assert.java:88)
	at org.junit.Assert.failNotEquals(Assert.java:834)
	at org.junit.Assert.assertEquals(Assert.java:118)
	at org.junit.Assert.assertEquals(Assert.java:144)
	at org.springframework.xd.dirt.stream.RabbitSingleNodeStreamDeploymentIntegrationTests.mqttSourceStreamReceivesMqttSinkStreamOutput(RabbitSingleNodeStreamDeploymentIntegrationTests.java:87)
	at sun.reflect.NativeMethodAccessorImpl.invoke0(Native Method)
(47 more lines...)
Existing test failures 1
Status Test Failing since Duration
java.lang.AssertionError: java.lang.AssertionError: 
Expected: an instance of [B
     but: null
java.lang.AssertionError: 
Expected: an instance of [B
     but: null
	at org.springframework.test.util.MatcherAssertionErrors.assertThat(MatcherAssertionErrors.java:80)
	at org.springframework.test.util.MatcherAssertionErrors.assertThat(MatcherAssertionErrors.java:53)
(49 more lines...)
Fixed tests 1
Status Test Failing since Duration
Successful KafkaSingleNodeStreamDeploymentIntegrationTests testBasicTap History
Failing since build #61 (Code changes detected) 10 secs