Build #124

Build plan for MS Windows

Build: #124 failed

Job: Default Job failed

Stages & jobs

  1. Default Stage

Test results

  • 3,724 tests in total
  • 2 tests failed
  • 2 failures are new
  • 10 tests were quarantined / skipped
  • 4 minutes taken in total.

Build 124 has the following 2 errors: 2 new failure(s) occurred since the previous build.

New test failures 2
Status Test Duration
Collapse Failed SplitInterruptedJobParserTests testSplitInterrupted History
< 1 sec
java.lang.AssertionError: java.lang.AssertionError: Wrong step names: []
java.lang.AssertionError: Wrong step names: []
	at org.junit.Assert.assertTrue(
	at org.springframework.batch.core.configuration.xml.SplitInterruptedJobParserTests.testSplitInterrupted(
	at sun.reflect.NativeMethodAccessorImpl.invoke0(Native Method)
	at sun.reflect.NativeMethodAccessorImpl.invoke(
	at sun.reflect.DelegatingMethodAccessorImpl.invoke(
(51 more lines...)
Collapse Failed JsrSplitParsingTests test History
< 1 sec
java.lang.AssertionError: java.lang.AssertionError: expected:<COMPLETED> but was:<FAILED>
java.lang.AssertionError: expected:<COMPLETED> but was:<FAILED>
	at org.junit.Assert.failNotEquals(
	at org.junit.Assert.assertEquals(
	at org.junit.Assert.assertEquals(
	at org.springframework.batch.core.jsr.configuration.xml.JsrSplitParsingTests.test(
	at sun.reflect.NativeMethodAccessorImpl.invoke0(Native Method)
(46 more lines...)